BDBM50064211 CHEMBL43111::Dicyclopropyl-methanone O-[2-hydroxy-3-(pyridin-4-ylamino)-propyl]-oxime
SMILES OC(CNc1ccncc1)CON=C(C1CC1)C1CC1
InChI Key InChIKey=LAYHIVACOPNUOL-UHFFFAOYSA-N
Data  1 IC50
  Tab Delimited (TSV)   2D SDfile   Computed 3D by Vconf -m prep SDfile
Find this compound or compounds like it in BindingDB:
Activity Spreadsheet -- Enzyme Inhibition Constant Data from BindingDB
Found 1 hit for monomerid = 50064211
TargetBeta-2 adrenergic receptor(Canis familiaris)
University Of Grenoble
Curated by ChEMBL
LigandPNGBDBM50064211(CHEMBL43111 | Dicyclopropyl-methanone O-[2-hydroxy...)
Affinity DataIC50: >1.00E+4nM. Assay description: Inhibition of beta-2 adrenergic receptor isolated from rat lung homogenates
In DepthDetails ArticlePubMed